Region3D
subclass of: GeographicRegion
comment: A three-dimensional geographic region.
type: Class

sequence length
range: integer
domain: Sequence
comment: The number of items in the ordered sequence.
type: FunctionalProperty
type: DatatypeProperty

subsequence start index
range: integer
domain: Subsequence
comment: A numeric position within a base sequence that represents the start of the subsequence.
type: DatatypeProperty

Numeric Parameter
subclass of: Thing
comment: A class representing numeric parameters explicitly as objects (versus representing them as datatype properties). These parameters can be inserted into containers and sequenced. This enables reuse of the same parameter value in multiple sequences.
type: Class

Region2D
subclass of: GeographicRegion
comment: A two-dimensional geographic region.
type: Class

Well-Known Text geographic representation
range: string
domain: Location
comment: The WKT string representation of a location. Well-known text (WKT) is a text markup language for representing vector geometry objects on a map, spatial reference systems of spatial objects and transformations between spatial reference systems. WKT is a standards-based representation stored as an alternative to the explicit polygon boundary representation employed in the Ontology (see gen:PolygonBoundary).
type: DatatypeProperty

Integer Parameter
subclass of: Restriction
  on property: parameter value
  all values from: integer
subclass of: Numeric Parameter
comment: A subclass of NumericParameter representing parameters with interger values.
type: Class

closed start time interval
range: boolean
domain: Time interval
comment: A boolean property that specifies whether or not the starting point of the time interval is closed (inclusive of the point).
type: DatatypeProperty

radius
range: float
domain: CircularRegion
comment: The radius of a circular region. Note: Unfortunately, the units are currently dependent the type of circular region defined. This needs to be improved.
type: FunctionalProperty
type: DatatypeProperty

general
version info: Created with TopBraid Composer
type: Ontology

Polygon boundary
subclass of: Restriction
  on property: hasSequencedItem
  all values from: PointLocation
subclass of: Restriction
  on property: hasLastItem
  all values from: PointLocation
subclass of: Restriction
  on property: hasFirstItem
  all values from: PointLocation
subclass of: Sequence
comment: An ordered sequence of point locations where the last point connects back to the first point, closing the polygon.
type: Class

subsequence of
range: Sequence
domain: Subsequence
comment: Links a subsequence to its base sequence.
type: ObjectProperty
type: FunctionalProperty

Sequence
subclass of: Thing
comment: An ordered sequence of items.
type: Class

hasFirstItem
sub property of: hasSequencedItem
range: Sequenced item
domain: Sequence
comment: Links a sequence to the first item being sequenced.
type: ObjectProperty

hasNext
range: Sequenced item
domain: Sequenced item
comment: Links an item in a sequence to the subsequent item in the sequence.
type: ObjectProperty
type: FunctionalProperty

Sequenced item
subclass of: Thing
comment: The set of items that can be sequenced.
type: Class

latitude
range: float
domain: PointLocation
comment: The latitude of a point location.
type: FunctionalProperty
type: DatatypeProperty

Polygonal2DRegion
subclass of: Region2D
comment: A two-dimensional region defined by a polygonal boundary.
type: Class

parameter value
domain: Numeric Parameter
comment: The numeric value of a parameter.
type: DatatypeProperty

longitude
range: float
domain: PointLocation
comment: The longitude of a point location.
type: FunctionalProperty
type: DatatypeProperty

Location
subclass of: Thing
comment: A place defined by a point or a contiguous geographic region.
type: Class

CircularRegion
subclass of: Region2D
comment: A two-dimensional region defined by a geographic centerpoint and radius.
type: Class

altitude
range: float
domain: PointLocation
comment: The altitude of a point location.
type: FunctionalProperty
type: DatatypeProperty

Subsequence
subclass of: Thing
comment: Represents a subsequence of existing base sequence. The subsequence does not replicate the items of the sequence, but merely points to the start and end positions within the base sequence.
type: Class

hasLastItem
sub property of: hasSequencedItem
range: Sequenced item
domain: Sequence
comment: Links a sequence to the last item being sequenced.
type: ObjectProperty

end time
range: dateTime
domain: Time interval
comment: The ending time of a defined time interval.
type: DatatypeProperty

start time
range: dateTime
domain: Time interval
comment: The starting time of a defined time interval.
type: DatatypeProperty

has polygon boundary
range: Polygon boundary
domain: Class
  union of: Polygonal2DRegion
  union of: Shear sided polygonal volume
comment: Links a polygonal region to its boundary representation.
type: ObjectProperty

Time interval
subclass of: Thing
comment: A time interval with starting and ending time points. Intervals can be open (including the end points) or closed including the end points) or mixed including one but not the other end point).
type: Class

Float parameter
subclass of: Restriction
  on property: parameter value
  all values from: float
subclass of: Numeric Parameter
comment: A subclass of NumericParameter representing parameters with floating-point values.
type: Class

closed end time interval
range: boolean
domain: Time interval
comment: A boolean property that specifies whether or not the endpoint of the time interval is closes (inclusive of the point).
type: DatatypeProperty

hasSequencedItem
range: Sequenced item
domain: Sequence
comment: Links a sequence to each of the items being sequenced.
type: ObjectProperty

subsequence end index
range: integer
domain: Subsequence
comment: A numeric position within a base sequence that represents the end of the subsequence.
type: DatatypeProperty

polygon height
range: float
domain: Shear sided polygonal volume
comment: Specifies the length dimension of a polygonal volume.
type: DatatypeProperty

GeographicRegion
subclass of: Location
comment: A class representing a demarcated region on or above the surface of the Earth.
type: Class

Shear sided polygonal volume
subclass of: Region3D
comment: A three-dimensional volume defined by a two-dimensional polygon plus a length component that stretches the polygon along an axis perpendicular to the polygon surface.
type: Class

sequenceNumber
range: integer
domain: Sequenced item
comment: Indicates the ordered position of this item within the sequence, where 1 signifies the first position in the sequence.
type: DatatypeProperty

centerpoint
range: PointLocation
domain: CircularRegion
comment: Links to the center point of the 2-D circular region.
type: ObjectProperty
type: FunctionalProperty

PointLocation
subclass of: Sequenced item
subclass of: Location
comment: A location in three-space defined by a latitude, longitude, and altitude.
type: Class